build fail (revision 3932)

classic Classic list List threaded Threaded
5 messages Options
Reply | Threaded
Open this post in threaded view
|  
Report Content as Inappropriate

build fail (revision 3932)

Rob Koberg
Hi,

I just checked out the latest restlet distro from subversion (revision  
3932).

I am getting the following build failure on the tests:

verify-tests:
     [mkdir] Created dir: /Users/rkobergmac/Documents/workspace/
restlet/build/temp/test
     [junit] Running com.noelios.restlet.test.NoeliosTestSuite
     [junit] <head>
     [junit]    <title>Status page</title>
     [junit] </head>
     [junit] <body>
     [junit] <h3>The server has not found anything matching the  
request URI</h3><p>You can get technical details <a href="http://www.w3.org/Protocols/rfc2616/rfc2616-sec10.html#sec10.4.5 
">here</a>.<br>
     [junit] Please continue your visit at our <a href="/">home page</
a>.
     [junit] </p>
     [junit] </body>
     [junit] </html>
     [junit] HTTP/1.1 404 The server has not found anything matching  
the request URI
     [junit] Content-Type: text/html; charset=ISO-8859-1
     [junit] Content-Length: 330
     [junit] Date: Sat, 01 Nov 2008 16:17:32 GMT
     [junit] Accept-Ranges: bytes
     [junit] Server: Noelios-Restlet-Engine/1.2.snapshot
     [junit]
     [junit] <html>
     [junit] <head>
     [junit]    <title>Status page</title>
     [junit] </head>
     [junit] <body>
     [junit] <h3>The server has not found anything matching the  
request URI</h3><p>You can get technical details <a href="http://www.w3.org/Protocols/rfc2616/rfc2616-sec10.html#sec10.4.5 
">here</a>.<br>
     [junit] Please continue your visit at our <a href="/">home page</
a>.
     [junit] </p>
     [junit] </body>
     [junit] </html>
     [junit] ]>)
     [junit] Tests run: 15, Failures: 1, Errors: 0, Time elapsed:  
15.312 sec

BUILD FAILED
/Users/rkobergmac/Documents/workspace/restlet/build/build.xml:1599:  
Test com.noelios.restlet.test.NoeliosTestSuite failed

Reply | Threaded
Open this post in threaded view
|  
Report Content as Inappropriate

Re: build fail (revision 3932)

Rob Koberg
Running ant build produces the following fail:


verify-tests:
     [junit] Running com.noelios.restlet.test.NoeliosTestSuite
     [junit] Invalid memory access of location 00000000 rip=01160767
     [junit]
     [junit] Running com.noelios.restlet.test.NoeliosTestSuite
     [junit] Tests run: 1, Failures: 0, Errors: 1, Time elapsed: 0 sec

BUILD FAILED
/Users/rkobergmac/Documents/workspace/restlet/build/build.xml:1599:  
Test com.noelios.restlet.test.NoeliosTestSuite failed (crashed)

My previous post was running the ant build default.

best,
-Rob


On Nov 1, 2008, at 12:20 PM, Robert Koberg wrote:

> Hi,
>
> I just checked out the latest restlet distro from subversion  
> (revision 3932).
>
> I am getting the following build failure on the tests:
>
> verify-tests:
>    [mkdir] Created dir: /Users/rkobergmac/Documents/workspace/
> restlet/build/temp/test
>    [junit] Running com.noelios.restlet.test.NoeliosTestSuite
>    [junit] <head>
>    [junit]    <title>Status page</title>
>    [junit] </head>
>    [junit] <body>
>    [junit] <h3>The server has not found anything matching the  
> request URI</h3><p>You can get technical details <a href="http://www.w3.org/Protocols/rfc2616/rfc2616-sec10.html#sec10.4.5 
> ">here</a>.<br>
>    [junit] Please continue your visit at our <a href="/">home page</
> a>.
>    [junit] </p>
>    [junit] </body>
>    [junit] </html>
>    [junit] HTTP/1.1 404 The server has not found anything matching  
> the request URI
>    [junit] Content-Type: text/html; charset=ISO-8859-1
>    [junit] Content-Length: 330
>    [junit] Date: Sat, 01 Nov 2008 16:17:32 GMT
>    [junit] Accept-Ranges: bytes
>    [junit] Server: Noelios-Restlet-Engine/1.2.snapshot
>    [junit]
>    [junit] <html>
>    [junit] <head>
>    [junit]    <title>Status page</title>
>    [junit] </head>
>    [junit] <body>
>    [junit] <h3>The server has not found anything matching the  
> request URI</h3><p>You can get technical details <a href="http://www.w3.org/Protocols/rfc2616/rfc2616-sec10.html#sec10.4.5 
> ">here</a>.<br>
>    [junit] Please continue your visit at our <a href="/">home page</
> a>.
>    [junit] </p>
>    [junit] </body>
>    [junit] </html>
>    [junit] ]>)
>    [junit] Tests run: 15, Failures: 1, Errors: 0, Time elapsed:  
> 15.312 sec
>
> BUILD FAILED
> /Users/rkobergmac/Documents/workspace/restlet/build/build.xml:1599:  
> Test com.noelios.restlet.test.NoeliosTestSuite failed
>

Reply | Threaded
Open this post in threaded view
|  
Report Content as Inappropriate

Re: build fail (revision 3932)

Thierry Boileau
Hello Robert,

could you send us the files located in the following directory: "build/temp/test"?
could you tell us which release of the JDK  are you using, your operating system, etc.?
It works on my X
Ubuntu 8.04 with jdk 1.5.0.16 and jdk 1.6.0.07.

 
Best regards,
Thierry Boileau
--
Restlet ~ Core developer ~ http://www.restlet.org
Noelios Technologies ~ Co-founder ~ http://www.noelios.com


Running ant build produces the following fail:


verify-tests:
    [junit] Running com.noelios.restlet.test.NoeliosTestSuite
    [junit] Invalid memory access of location 00000000 rip=01160767
    [junit]
    [junit] Running com.noelios.restlet.test.NoeliosTestSuite
    [junit] Tests run: 1, Failures: 0, Errors: 1, Time elapsed: 0 sec

BUILD FAILED
/Users/rkobergmac/Documents/workspace/restlet/build/build.xml:1599: Test com.noelios.restlet.test.NoeliosTestSuite failed (crashed)

My previous post was running the ant build default.

best,
-Rob


On Nov 1, 2008, at 12:20 PM, Robert Koberg wrote:

Hi,

I just checked out the latest restlet distro from subversion (revision 3932).

I am getting the following build failure on the tests:

verify-tests:
   [mkdir] Created dir: /Users/rkobergmac/Documents/workspace/restlet/build/temp/test
   [junit] Running com.noelios.restlet.test.NoeliosTestSuite
   [junit] <head>
   [junit]    <title>Status page</title>
   [junit] </head>
   [junit] <body>
   [junit] <h3>The server has not found anything matching the request URI</h3><p>You can get technical details <a href="http://www.w3.org/Protocols/rfc2616/rfc2616-sec10.html#sec10.4.5">here</a>.<br>
   [junit] Please continue your visit at our <a href="/">home page</a>.
   [junit] </p>
   [junit] </body>
   [junit] </html>
   [junit] HTTP/1.1 404 The server has not found anything matching the request URI
   [junit] Content-Type: text/html; charset=ISO-8859-1
   [junit] Content-Length: 330
   [junit] Date: Sat, 01 Nov 2008 16:17:32 GMT
   [junit] Accept-Ranges: bytes
   [junit] Server: Noelios-Restlet-Engine/1.2.snapshot
   [junit]
   [junit] <html>
   [junit] <head>
   [junit]    <title>Status page</title>
   [junit] </head>
   [junit] <body>
   [junit] <h3>The server has not found anything matching the request URI</h3><p>You can get technical details <a href="http://www.w3.org/Protocols/rfc2616/rfc2616-sec10.html#sec10.4.5">here</a>.<br>
   [junit] Please continue your visit at our <a href="/">home page</a>.
   [junit] </p>
   [junit] </body>
   [junit] </html>
   [junit] ]>)
   [junit] Tests run: 15, Failures: 1, Errors: 0, Time elapsed: 15.312 sec

BUILD FAILED
/Users/rkobergmac/Documents/workspace/restlet/build/build.xml:1599: Test com.noelios.restlet.test.NoeliosTestSuite failed

Reply | Threaded
Open this post in threaded view
|  
Report Content as Inappropriate

Re: build fail (revision 3932)

Rob Koberg

On Nov 1, 2008, at 8:01 PM, Thierry Boileau wrote:

> Hello Robert,
>
> could you send us the files located in the following directory:  
> "build/temp/test"?
> could you tell us which release of the JDK  are you using, your  
> operating system, etc.?
> It works on my XUbuntu 8.04 with jdk 1.5.0.16 and jdk 1.6.0.07.

Here is the build/temp/test/TEST-
com.noelios.restlet.test.NoeliosTestSuite.txt (the only file in the  
dir) for 'ant build' -- I don't have glassfish installed:

Testsuite: com.noelios.restlet.test.NoeliosTestSuite
Tests run: 1, Failures: 0, Errors: 1, Time elapsed: 0 sec

Testcase: testGrizzlyAndApache took 0.003 sec
        Caused an ERROR
Forked Java VM exited abnormally. Please note the time in the report  
does not reflect the time until the VM exit.
junit.framework.AssertionFailedError: Forked Java VM exited  
abnormally. Please note the time in the report does not reflect the  
time until the VM exit.

And 'ant -diagnostics' gives (system details):

------- Ant diagnostics report -------
Apache Ant version 1.7.1 compiled on June 27 2008

-------------------------------------------
  Implementation Version
-------------------------------------------
core tasks     : 1.7.1
optional tasks : not available

-------------------------------------------
  ANT PROPERTIES
-------------------------------------------
ant.version: Apache Ant version 1.7.1 compiled on June 27 2008
ant.java.version: 1.6
ant.core.lib: /Applications/ant/lib/ant.jar
ant.home: /Applications/ant

-------------------------------------------
  ANT_HOME/lib jar listing
-------------------------------------------
ant.home: /Applications/ant
ant-antlr.jar (5752 bytes)
ant-apache-bcel.jar (8611 bytes)
ant-apache-bsf.jar (3939 bytes)
ant-apache-log4j.jar (3056 bytes)
ant-apache-oro.jar (39627 bytes)
ant-apache-regexp.jar (3762 bytes)
ant-apache-resolver.jar (4071 bytes)
ant-commons-logging.jar (3910 bytes)
ant-commons-net.jar (47026 bytes)
ant-jai.jar (21348 bytes)
ant-javamail.jar (6998 bytes)
ant-jdepend.jar (8132 bytes)
ant-jmf.jar (6593 bytes)
ant-jsch.jar (30797 bytes)
ant-junit.jar (93518 bytes)
ant-launcher.jar (12143 bytes)
ant-netrexx.jar (9881 bytes)
ant-nodeps.jar (431580 bytes)
ant-starteam.jar (35355 bytes)
ant-stylebook.jar (2330 bytes)
ant-swing.jar (6738 bytes)
ant-testutil.jar (14941 bytes)
ant-trax.jar (6881 bytes)
ant-weblogic.jar (14205 bytes)
ant.jar (1323005 bytes)
resolver.jar (84091 bytes)
saxon9-dom.jar (126167 bytes)
saxon9-dom4j.jar (34064 bytes)
saxon9-jdom.jar (36793 bytes)
saxon9-s9api.jar (127765 bytes)
saxon9-sql.jar (44743 bytes)
saxon9-xom.jar (56342 bytes)
saxon9-xpath.jar (44925 bytes)
saxon9-xqj.jar (192550 bytes)
saxon9.jar (5024396 bytes)
xercesImpl.jar (1223877 bytes)
xml-apis.jar (194354 bytes)

-------------------------------------------
  USER_HOME/.ant/lib jar listing
-------------------------------------------
user.home: /Users/rkobergmac
No such directory.

-------------------------------------------
  Tasks availability
-------------------------------------------
sshexec : Missing dependency com.jcraft.jsch.UserInfo
scp : Missing dependency com.jcraft.jsch.UserInfo
jdepend : Missing dependency jdepend.xmlui.JDepend
A task being missing/unavailable should only matter if you are trying  
to use it

-------------------------------------------
  org.apache.env.Which diagnostics
-------------------------------------------
Not available.
Download it at http://xml.apache.org/commons/

-------------------------------------------
  XML Parser information
-------------------------------------------
XML Parser : org.apache.xerces.jaxp.SAXParserImpl
XML Parser Location: /Applications/ant/lib/xercesImpl.jar
Namespace-aware parser : org.apache.xerces.jaxp.SAXParserImpl
$JAXPSAXParser
Namespace-aware parser Location: /Applications/ant/lib/xercesImpl.jar

-------------------------------------------
  System properties
-------------------------------------------
java.runtime.name : Java(TM) SE Runtime Environment
sun.boot.library.path : /System/Library/Frameworks/JavaVM.framework/
Versions/1.6.0/Libraries
java.vm.version : 1.6.0_07-b06-57
awt.nativeDoubleBuffering : true
ant.library.dir : /Applications/ant/lib
gopherProxySet : false
java.vm.vendor : Apple Inc.
java.vendor.url : http://www.apple.com/
path.separator : :
java.vm.name : Java HotSpot(TM) 64-Bit Server VM
file.encoding.pkg : sun.io
user.country : US
sun.java.launcher : SUN_STANDARD
sun.os.patch.level : unknown
java.vm.specification.name : Java Virtual Machine Specification
user.dir : /Users/rkobergmac/Documents/workspace/restlet/build
java.runtime.version : 1.6.0_07-b06-153
java.awt.graphicsenv : apple.awt.CGraphicsEnvironment
java.endorsed.dirs : /System/Library/Frameworks/JavaVM.framework/
Versions/1.6.0/Home/lib/endorsed
os.arch : x86_64
java.io.tmpdir : /tmp
line.separator :

java.vm.specification.vendor : Sun Microsystems Inc.
os.name : Mac OS X
ant.home : /Applications/ant
sun.jnu.encoding : MacRoman
java.library.path : .:/Library/Java/Extensions:/System/Library/Java/
Extensions:/usr/lib/java
java.specification.name : Java Platform API Specification
java.class.version : 50.0
sun.management.compiler : HotSpot 64-Bit Server Compiler
os.version : 10.5.5
http.nonProxyHosts : local|*.local|169.254/16|*.169.254/16
user.home : /Users/rkobergmac
user.timezone : America/New_York
java.awt.printerjob : apple.awt.CPrinterJob
java.specification.version : 1.6
file.encoding : MacRoman
user.name : rkobergmac
java.class.path : /Applications/ant/lib/ant-launcher.jar:/Applications/
ant/lib/ant-antlr.jar:/Applications/ant/lib/ant-apache-bcel.jar:/
Applications/ant/lib/ant-apache-bsf.jar:/Applications/ant/lib/ant-
apache-log4j.jar:/Applications/ant/lib/ant-apache-oro.jar:/
Applications/ant/lib/ant-apache-regexp.jar:/Applications/ant/lib/ant-
apache-resolver.jar:/Applications/ant/lib/ant-commons-logging.jar:/
Applications/ant/lib/ant-commons-net.jar:/Applications/ant/lib/ant-
jai.jar:/Applications/ant/lib/ant-javamail.jar:/Applications/ant/lib/
ant-jdepend.jar:/Applications/ant/lib/ant-jmf.jar:/Applications/ant/
lib/ant-jsch.jar:/Applications/ant/lib/ant-junit.jar:/Applications/ant/
lib/ant-launcher.jar:/Applications/ant/lib/ant-netrexx.jar:/
Applications/ant/lib/ant-nodeps.jar:/Applications/ant/lib/ant-
starteam.jar:/Applications/ant/lib/ant-stylebook.jar:/Applications/ant/
lib/ant-swing.jar:/Applications/ant/lib/ant-testutil.jar:/Applications/
ant/lib/ant-trax.jar:/Applications/ant/lib/ant-weblogic.jar:/
Applications/ant/lib/ant.jar:/Applications/ant/lib/resolver.jar:/
Applications/ant/lib/saxon9-dom.jar:/Applications/ant/lib/saxon9-
dom4j.jar:/Applications/ant/lib/saxon9-jdom.jar:/Applications/ant/lib/
saxon9-s9api.jar:/Applications/ant/lib/saxon9-sql.jar:/Applications/
ant/lib/saxon9-xom.jar:/Applications/ant/lib/saxon9-xpath.jar:/
Applications/ant/lib/saxon9-xqj.jar:/Applications/ant/lib/saxon9.jar:/
Applications/ant/lib/xercesImpl.jar:/Applications/ant/lib/xml-apis.jar
java.vm.specification.version : 1.0
sun.arch.data.model : 64
java.home : /System/Library/Frameworks/JavaVM.framework/Versions/1.6.0/
Home
java.specification.vendor : Sun Microsystems Inc.
user.language : en
awt.toolkit : apple.awt.CToolkit
java.vm.info : mixed mode
java.version : 1.6.0_07
java.ext.dirs : /Library/Java/Extensions:/System/Library/Java/
Extensions:/System/Library/Frameworks/JavaVM.framework/Versions/1.6.0/
Home/lib/ext
sun.boot.class.path : /System/Library/Frameworks/JavaVM.framework/
Versions/1.6.0/Classes/classes.jar:/System/Library/Frameworks/
JavaVM.framework/Versions/1.6.0/Classes/ui.jar:/System/Library/
Frameworks/JavaVM.framework/Versions/1.6.0/Classes/laf.jar:/System/
Library/Frameworks/JavaVM.framework/Versions/1.6.0/Classes/
sunrsasign.jar:/System/Library/Frameworks/JavaVM.framework/Versions/
1.6.0/Classes/jsse.jar:/System/Library/Frameworks/JavaVM.framework/
Versions/1.6.0/Classes/jce.jar:/System/Library/Frameworks/
JavaVM.framework/Versions/1.6.0/Classes/charsets.jar
java.vendor : Apple Inc.
file.separator : /
java.vendor.url.bug : http://bugreport.apple.com/
sun.cpu.endian : little
sun.io.unicode.encoding : UnicodeLittle
mrj.version : 1040.1.6.0_07-153
socksNonProxyHosts : local|*.local|169.254/16|*.169.254/16
jikes.class.path : :/System/Library/Frameworks/JavaVM.framework/
Versions/1.6/Home/../Classes/charsets.jar:/System/Library/Frameworks/
JavaVM.framework/Versions/1.6/Home/../Classes/classes.jar:/System/
Library/Frameworks/JavaVM.framework/Versions/1.6/Home/../Classes/
dt.jar:/System/Library/Frameworks/JavaVM.framework/Versions/1.6/
Home/../Classes/jce.jar:/System/Library/Frameworks/JavaVM.framework/
Versions/1.6/Home/../Classes/jconsole.jar:/System/Library/Frameworks/
JavaVM.framework/Versions/1.6/Home/../Classes/jsse.jar:/System/Library/
Frameworks/JavaVM.framework/Versions/1.6/Home/../Classes/laf.jar:/
System/Library/Frameworks/JavaVM.framework/Versions/1.6/Home/../
Classes/management-agent.jar:/System/Library/Frameworks/
JavaVM.framework/Versions/1.6/Home/../Classes/ui.jar
ftp.nonProxyHosts : local|*.local|169.254/16|*.169.254/16
sun.cpu.isalist :

-------------------------------------------
  Temp dir
-------------------------------------------
Temp dir is /tmp
Temp dir is writeable
Temp dir alignment with system clock is -159 ms

-------------------------------------------
  Locale information
-------------------------------------------
Timezone Eastern Standard Time offset=-14400000




>
>
>
> Best regards,
> Thierry Boileau
> --
> Restlet ~ Core developer ~ http://www.restlet.org
> Noelios Technologies ~ Co-founder ~ http://www.noelios.com
>
>> Running ant build produces the following fail:
>>
>>
>> verify-tests:
>>     [junit] Running com.noelios.restlet.test.NoeliosTestSuite
>>     [junit] Invalid memory access of location 00000000 rip=01160767
>>     [junit]
>>     [junit] Running com.noelios.restlet.test.NoeliosTestSuite
>>     [junit] Tests run: 1, Failures: 0, Errors: 1, Time elapsed: 0 sec
>>
>> BUILD FAILED
>> /Users/rkobergmac/Documents/workspace/restlet/build/build.xml:1599:  
>> Test com.noelios.restlet.test.NoeliosTestSuite failed (crashed)


Reply | Threaded
Open this post in threaded view
|  
Report Content as Inappropriate

Re: build fail (revision 3932)

Thierry Boileau
Hello Robert

If it's possible for you to install 2 versions of the JDK, could you try with the JDK5 for your operating system?

Otherwise, could you update the "com.noelios.restlet.test.BaseConnectorsTestCase" class?
There is a serie of boolean indicators that helps to create the client/serveur combinations. You can set some of them to false, in order to precise what kind of client or server connectors cause the problem.
Here is the list :
    private final boolean enableApacheClient = true;
    private final boolean enableInternalClient = true;
    private final boolean enableJdkNetClient = true;
    private final boolean enableGrizzlyServer = true;
    private final boolean enableInternalServer = true;
    private final boolean enableJettyServer = true;
    private final boolean enableSimpleServer = true;


Best regards,
Thierry Boileau
--
Restlet ~ Core developer ~ http://www.restlet.org
Noelios Technologies ~ Co-founder ~ http://www.noelios.com



Hello Robert,

could you send us the files located in the following directory: "build/temp/test"?
could you tell us which release of the JDK  are you using, your operating system, etc.?
It works on my XUbuntu 8.04 with jdk 1.5.0.16 and jdk 1.6.0.07.

Here is the build/temp/test/TEST-com.noelios.restlet.test.NoeliosTestSuite.txt (the only file in the dir) for 'ant build' -- I don't have glassfish installed:

Testsuite: com.noelios.restlet.test.NoeliosTestSuite
Tests run: 1, Failures: 0, Errors: 1, Time elapsed: 0 sec

Testcase: testGrizzlyAndApache took 0.003 sec
    Caused an ERROR
Forked Java VM exited abnormally. Please note the time in the report does not reflect the time until the VM exit.
junit.framework.AssertionFailedError: Forked Java VM exited abnormally. Please note the time in the report does not reflect the time until the VM exit.

And 'ant -diagnostics' gives (system details):

------- Ant diagnostics report -------
Apache Ant version 1.7.1 compiled on June 27 2008

-------------------------------------------
 Implementation Version
-------------------------------------------
core tasks     : 1.7.1
optional tasks : not available

-------------------------------------------
 ANT PROPERTIES
-------------------------------------------
ant.version: Apache Ant version 1.7.1 compiled on June 27 2008
ant.java.version: 1.6
ant.core.lib: /Applications/ant/lib/ant.jar
ant.home: /Applications/ant

-------------------------------------------
 ANT_HOME/lib jar listing
-------------------------------------------
ant.home: /Applications/ant
ant-antlr.jar (5752 bytes)
ant-apache-bcel.jar (8611 bytes)
ant-apache-bsf.jar (3939 bytes)
ant-apache-log4j.jar (3056 bytes)
ant-apache-oro.jar (39627 bytes)
ant-apache-regexp.jar (3762 bytes)
ant-apache-resolver.jar (4071 bytes)
ant-commons-logging.jar (3910 bytes)
ant-commons-net.jar (47026 bytes)
ant-jai.jar (21348 bytes)
ant-javamail.jar (6998 bytes)
ant-jdepend.jar (8132 bytes)
ant-jmf.jar (6593 bytes)
ant-jsch.jar (30797 bytes)
ant-junit.jar (93518 bytes)
ant-launcher.jar (12143 bytes)
ant-netrexx.jar (9881 bytes)
ant-nodeps.jar (431580 bytes)
ant-starteam.jar (35355 bytes)
ant-stylebook.jar (2330 bytes)
ant-swing.jar (6738 bytes)
ant-testutil.jar (14941 bytes)
ant-trax.jar (6881 bytes)
ant-weblogic.jar (14205 bytes)
ant.jar (1323005 bytes)
resolver.jar (84091 bytes)
saxon9-dom.jar (126167 bytes)
saxon9-dom4j.jar (34064 bytes)
saxon9-jdom.jar (36793 bytes)
saxon9-s9api.jar (127765 bytes)
saxon9-sql.jar (44743 bytes)
saxon9-xom.jar (56342 bytes)
saxon9-xpath.jar (44925 bytes)
saxon9-xqj.jar (192550 bytes)
saxon9.jar (5024396 bytes)
xercesImpl.jar (1223877 bytes)
xml-apis.jar (194354 bytes)

-------------------------------------------
 USER_HOME/.ant/lib jar listing
-------------------------------------------
user.home: /Users/rkobergmac
No such directory.

-------------------------------------------
 Tasks availability
-------------------------------------------
sshexec : Missing dependency com.jcraft.jsch.UserInfo
scp : Missing dependency com.jcraft.jsch.UserInfo
jdepend : Missing dependency jdepend.xmlui.JDepend
A task being missing/unavailable should only matter if you are trying to use it

-------------------------------------------
 org.apache.env.Which diagnostics
-------------------------------------------
Not available.
Download it at http://xml.apache.org/commons/

-------------------------------------------
 XML Parser information
-------------------------------------------
XML Parser : org.apache.xerces.jaxp.SAXParserImpl
XML Parser Location: /Applications/ant/lib/xercesImpl.jar
Namespace-aware parser : org.apache.xerces.jaxp.SAXParserImpl$JAXPSAXParser
Namespace-aware parser Location: /Applications/ant/lib/xercesImpl.jar

-------------------------------------------
 System properties
-------------------------------------------
java.runtime.name : Java(TM) SE Runtime Environment
sun.boot.library.path : /System/Library/Frameworks/JavaVM.framework/Versions/1.6.0/Libraries
java.vm.version : 1.6.0_07-b06-57
awt.nativeDoubleBuffering : true
ant.library.dir : /Applications/ant/lib
gopherProxySet : false
java.vm.vendor : Apple Inc.
java.vendor.url : http://www.apple.com/
path.separator : :
java.vm.name : Java HotSpot(TM) 64-Bit Server VM
file.encoding.pkg : sun.io
user.country : US
sun.java.launcher : SUN_STANDARD
sun.os.patch.level : unknown
java.vm.specification.name : Java Virtual Machine Specification
user.dir : /Users/rkobergmac/Documents/workspace/restlet/build
java.runtime.version : 1.6.0_07-b06-153
java.awt.graphicsenv : apple.awt.CGraphicsEnvironment
java.endorsed.dirs : /System/Library/Frameworks/JavaVM.framework/Versions/1.6.0/Home/lib/endorsed
os.arch : x86_64
java.io.tmpdir : /tmp
line.separator :

java.vm.specification.vendor : Sun Microsystems Inc.
os.name : Mac OS X
ant.home : /Applications/ant
sun.jnu.encoding : MacRoman
java.library.path : .:/Library/Java/Extensions:/System/Library/Java/Extensions:/usr/lib/java
java.specification.name : Java Platform API Specification
java.class.version : 50.0
sun.management.compiler : HotSpot 64-Bit Server Compiler
os.version : 10.5.5
http.nonProxyHosts : local|*.local|169.254/16|*.169.254/16
user.home : /Users/rkobergmac
user.timezone : America/New_York
java.awt.printerjob : apple.awt.CPrinterJob
java.specification.version : 1.6
file.encoding : MacRoman
user.name : rkobergmac
java.class.path : /Applications/ant/lib/ant-launcher.jar:/Applications/ant/lib/ant-antlr.jar:/Applications/ant/lib/ant-apache-bcel.jar:/Applications/ant/lib/ant-apache-bsf.jar:/Applications/ant/lib/ant-apache-log4j.jar:/Applications/ant/lib/ant-apache-oro.jar:/Applications/ant/lib/ant-apache-regexp.jar:/Applications/ant/lib/ant-apache-resolver.jar:/Applications/ant/lib/ant-commons-logging.jar:/Applications/ant/lib/ant-commons-net.jar:/Applications/ant/lib/ant-jai.jar:/Applications/ant/lib/ant-javamail.jar:/Applications/ant/lib/ant-jdepend.jar:/Applications/ant/lib/ant-jmf.jar:/Applications/ant/lib/ant-jsch.jar:/Applications/ant/lib/ant-junit.jar:/Applications/ant/lib/ant-launcher.jar:/Applications/ant/lib/ant-netrexx.jar:/Applications/ant/lib/ant-nodeps.jar:/Applications/ant/lib/ant-starteam.jar:/Applications/ant/lib/ant-stylebook.jar:/Applications/ant/lib/ant-swing.jar:/Applications/ant/lib/ant-testutil.jar:/Applications/ant/lib/ant-trax.jar:/Applications/ant/lib/ant-weblogic.jar:/Application s/ant/lib/ant.jar:/Applications/ant/lib/resolver.jar:/Applications/ant/lib/saxon9-dom.jar:/Applications/ant/lib/saxon9-dom4j.jar:/Applications/ant/lib/saxon9-jdom.jar:/Applications/ant/lib/saxon9-s9api.jar:/Applications/ant/lib/saxon9-sql.jar:/Applications/ant/lib/saxon9-xom.jar:/Applications/ant/lib/saxon9-xpath.jar:/Applications/ant/lib/saxon9-xqj.jar:/Applications/ant/lib/saxon9.jar:/Applications/ant/lib/xercesImpl.jar:/Applications/ant/lib/xml-apis.jar
java.vm.specification.version : 1.0
sun.arch.data.model : 64
java.home : /System/Library/Frameworks/JavaVM.framework/Versions/1.6.0/Home
java.specification.vendor : Sun Microsystems Inc.
user.language : en
awt.toolkit : apple.awt.CToolkit
java.vm.info : mixed mode
java.version : 1.6.0_07
java.ext.dirs : /Library/Java/Extensions:/System/Library/Java/Extensions:/System/Library/Frameworks/JavaVM.framework/Versions/1.6.0/Home/lib/ext
sun.boot.class.path : /System/Library/Frameworks/JavaVM.framework/Versions/1.6.0/Classes/classes.jar:/System/Library/Frameworks/JavaVM.framework/Versions/1.6.0/Classes/ui.jar:/System/Library/Frameworks/JavaVM.framework/Versions/1.6.0/Classes/laf.jar:/System/Library/Frameworks/JavaVM.framework/Versions/1.6.0/Classes/sunrsasign.jar:/System/Library/Frameworks/JavaVM.framework/Versions/1.6.0/Classes/jsse.jar:/System/Library/Frameworks/JavaVM.framework/Versions/1.6.0/Classes/jce.jar:/System/Library/Frameworks/JavaVM.framework/Versions/1.6.0/Classes/charsets.jar
java.vendor : Apple Inc.
file.separator : /
java.vendor.url.bug : http://bugreport.apple.com/
sun.cpu.endian : little
sun.io.unicode.encoding : UnicodeLittle
mrj.version : 1040.1.6.0_07-153
socksNonProxyHosts : local|*.local|169.254/16|*.169.254/16
jikes.class.path : :/System/Library/Frameworks/JavaVM.framework/Versions/1.6/Home/../Classes/charsets.jar:/System/Library/Frameworks/JavaVM.framework/Versions/1.6/Home/../Classes/classes.jar:/System/Library/Frameworks/JavaVM.framework/Versions/1.6/Home/../Classes/dt.jar:/System/Library/Frameworks/JavaVM.framework/Versions/1.6/Home/../Classes/jce.jar:/System/Library/Frameworks/JavaVM.framework/Versions/1.6/Home/../Classes/jconsole.jar:/System/Library/Frameworks/JavaVM.framework/Versions/1.6/Home/../Classes/jsse.jar:/System/Library/Frameworks/JavaVM.framework/Versions/1.6/Home/../Classes/laf.jar:/System/Library/Frameworks/JavaVM.framework/Versions/1.6/Home/../Classes/management-agent.jar:/System/Library/Frameworks/JavaVM.framework/Versions/1.6/Home/../Classes/ui.jar
ftp.nonProxyHosts : local|*.local|169.254/16|*.169.254/16
sun.cpu.isalist :

-------------------------------------------
 Temp dir
-------------------------------------------
Temp dir is /tmp
Temp dir is writeable
Temp dir alignment with system clock is -159 ms

-------------------------------------------
 Locale information
-------------------------------------------
Timezone Eastern Standard Time offset=-14400000







Best regards,
Thierry Boileau
--
Restlet ~ Core developer ~ http://www.restlet.org
Noelios Technologies ~ Co-founder ~ http://www.noelios.com

Running ant build produces the following fail:


verify-tests:
    [junit] Running com.noelios.restlet.test.NoeliosTestSuite
    [junit] Invalid memory access of location 00000000 rip=01160767
    [junit]
    [junit] Running com.noelios.restlet.test.NoeliosTestSuite
    [junit] Tests run: 1, Failures: 0, Errors: 1, Time elapsed: 0 sec

BUILD FAILED
/Users/rkobergmac/Documents/workspace/restlet/build/build.xml:1599: Test com.noelios.restlet.test.NoeliosTestSuite failed (crashed)
Loading...